detected,source_name,other_name,ra,dec,l,b,vlow,vup,vpeak,vrange,rms,peak,units,int,ref,telescope_ref,ra_hms,dec_dms,freq,sptype,jyk,grp,gc_flag,beam,rms_mjy_flag,mjy_flag,dist,thermal,date_txt,atlasgal,peak_num,rms_num,fwhm,interf_ra,interf_dec,interf_l,interf_b,is_interf,image_descr,line,v_step,telescope_conf,grpv,rms_approx_flag,
,,,deg. (J2000),deg. (J2000),(deg.),(deg.),(km/s),(km/s),(km/s),(km/s),(Jy),(Jy),,(Jy*km/s),,,(J2000),(J2000),(MHz),,,,,(arcsec),,,(kpc),line mark,,,,,(km/s),,,,,,,,(km/s),,,,
1,IRAS05274+3345,,82.7766670,33.7908330,174.2421450,-0.0215900,-5.0,0.6,-3.6,5.6,,1.340,Jy,,EF2007,,05 31 6.4,+33 47 27,1665,,,G174.242-0.022,0,,,,,0,,,1.340,,,82.7766670,33.7908330,174.2421450,-0.0215900,,,1665,,,G174.2421-0.0216,,
1,IRAS05274+3345,,82.7766670,33.7908330,174.2421450,-0.0215900,,,-4.9,,,0.140,Jy,,EF2007,,05 31 6.4,+33 47 27,1667,,,G174.242-0.022,0,,,,,0,,,0.140,,,82.7766670,33.7908330,174.2421450,-0.0215900,,,1667,,,G174.2421-0.0216,,
1,IRAS05274+3345,,82.7766670,33.7908330,174.2421450,-0.0215900,,,-3.9,,,0.130,Jy,,EF2007,,05 31 6.4,+33 47 27,1612,,,G174.242-0.022,0,,,,,0,,,0.130,,,82.7766670,33.7908330,174.2421450,-0.0215900,,,1612,,,G174.2421-0.0216,,
1,IRAS05358+3543,,84.8041670,35.7641670,173.4816480,2.4459210,-16.5,-8.5,-10.9,8.0,,2.820,Jy,,EF2007,,05 39 13,+35 45 51,1665,,,G173.481+2.446,0,,,,,0,,,2.820,,,84.8041670,35.7641670,173.4816480,2.4459210,,,1665,,,G173.4808+2.4461,,
1,IRAS05358+3543,,84.8041670,35.7641670,173.4816480,2.4459210,,,-10.5,,,0.930,Jy,,EF2007,,05 39 13,+35 45 51,1667,,,G173.481+2.446,0,,,,,0,,,0.930,,,84.8041670,35.7641670,173.4816480,2.4459210,,,1667,,,G173.4808+2.4461,,
1,IRAS05382+3547,,85.3037500,35.9016670,173.5796050,2.8623060,-27.0,-26.5,-26.8,0.5,,0.500,Jy,,EF2007,,05 41 12.9,+35 54 06,1665,,,G173.580+2.862,0,,,,,0,,,0.500,,,85.3037500,35.9016670,173.5796050,2.8623060,,,1665,,,G173.5796+2.8623,,
1,IRAS06056+2131,,92.2183330,21.5683330,189.0083040,0.8473830,3.0,11.0,10.1,8.0,,3.230,Jy,,EF2007,,06 08 52.4,+21 34 06,1665,,,G189.008+0.847,0,,,,,0,,,3.230,,,92.2183330,21.5683330,189.0083040,0.8473830,,,1665,,,G189.0083+0.8474,,
1,IRAS06056+2131,,92.2183330,21.5683330,189.0083040,0.8473830,,,9.4,,,0.220,Jy,,EF2007,,06 08 52.4,+21 34 06,1667,,,G189.008+0.847,0,,,,,0,,,0.220,,,92.2183330,21.5683330,189.0083040,0.8473830,,,1667,,,G189.0083+0.8474,,
1,IRAS06056+2131,,92.2183330,21.5683330,189.0083040,0.8473830,,,3.4,,,0.600,Jy,,EF2007,,06 08 52.4,+21 34 06,1720,,,G189.008+0.847,0,,,,,0,,,0.600,,,92.2183330,21.5683330,189.0083040,0.8473830,,,1720,,,G189.0083+0.8474,,
1,IRAS17527-2439,,268.8679170,-24.6100000,4.8413430,0.3291400,8.2,12.2,11.5,4.0,,0.400,Jy,,EF2007,,17 55 28.3,-24 36 36,1665,,,G4.841+0.329,0,,,,,0,,,0.400,,,268.8679170,-24.6100000,4.8413430,0.3291400,,,1665,,,G4.8413+0.3291,,
1,IRAS18018-2426,,271.2212500,-24.4447220,6.0485760,-1.4467600,,,11.1,,,0.980,Jy,,EF2007,,18 04 53.1,-24 26 41,1667,,,G6.050-1.449,0,,,,,0,,,0.980,,,271.2212500,-24.4447220,6.0485760,-1.4467600,,,1667,,,G6.0499-1.4493,,
1,IRAS18024-2119,,271.3566670,-21.2497220,8.8959780,0.0084410,-9.0,31.0,-4.1,40.0,,0.690,Jy,,EF2007,,18 05 25.6,-21 14 59,1665,,,G8.896+0.008,0,,,,,0,,,0.690,,,271.3566670,-21.2497220,8.8959780,0.0084410,,,1665,,,G8.8960+0.0084,,
1,IRAS18024-2119,,271.3566670,-21.2497220,8.8959780,0.0084410,,,-3.8,,,0.380,Jy,,EF2007,,18 05 25.6,-21 14 59,1667,,,G8.896+0.008,0,,,,,0,,,0.380,,,271.3566670,-21.2497220,8.8959780,0.0084410,,,1667,,,G8.8960+0.0084,,
1,IRAS18048-2019,,271.9358330,-20.3113890,9.9792340,-0.0066200,,,40.3,,,0.270,Jy,,EF2007,,18 07 44.6,-20 18 41,1667,,,G9.979-0.007,0,,,,,0,,,0.270,,,271.9358330,-20.3113890,9.9792340,-0.0066200,,,1667,,,G9.9792-0.0066,,
1,IRAS18090-1832,,272.9475000,-18.4963890,12.0293110,0.0358670,103.0,,108.9,103.0,,0.700,Jy,,EF2007,,18 11 47.4,-18 29 47,1665,,,G12.029+0.036,0,,,,,0,,,0.700,,,272.9475000,-18.4963890,12.0293110,0.0358670,,,1665,,,G12.0293+0.0359,,
1,IRAS18090-1832,,272.9475000,-18.4963890,12.0293110,0.0358670,,,106.6,,,0.490,Jy,,EF2007,,18 11 47.4,-18 29 47,1667,,,G12.029+0.036,0,,,,,0,,,0.490,,,272.9475000,-18.4963890,12.0293110,0.0358670,,,1667,,,G12.0293+0.0359,,
1,IRAS18089-1732,,272.9641670,-17.5247220,12.8888420,0.4893130,,,33.4,,,2.000,Jy,,EF2007,,18 11 51.4,-17 31 29,1667,,,G12.889+0.490,0,,,,,0,,,2.000,,,272.9641670,-17.5247220,12.8888420,0.4893130,,,1667,,,G12.8887+0.4898,,
1,IRAS18102-1800,,273.2683330,-18.0063890,12.6054340,0.0039390,24.0,25.0,24.4,1.0,,0.420,Jy,,EF2007,,18 13 4.4,-18 00 23,1665,,,G12.605+0.004,0,,,,,0,,,0.420,,,273.2683330,-18.0063890,12.6054340,0.0039390,,,1665,,,G12.6054+0.0039,,
1,IRAS18144-1723,,274.3604170,-17.3747220,13.6568840,-0.6092470,48.0,64.0,48.3,16.0,,35.900,Jy,,EF2007,,18 17 26.5,-17 22 29,1665,,,G13.657-0.600,0,,,,,0,,,35.900,,,274.3604170,-17.3747220,13.6568840,-0.6092470,,,1665,,,G13.6569-0.6092,,
1,IRAS18144-1723,,274.3604170,-17.3747220,13.6568840,-0.6092470,,,61.8,,,4.800,Jy,,EF2007,,18 17 26.5,-17 22 29,1667,,,G13.657-0.600,0,,,,,0,,,4.800,,,274.3604170,-17.3747220,13.6568840,-0.6092470,,,1667,,,G13.6569-0.6092,,
1,IRAS18182-1433,,275.2958330,-14.5230560,16.5950530,-0.0540410,58.0,64.0,61.6,6.0,,0.720,Jy,,EF2007,,18 21 11,-14 31 23,1665,,,G16.585-0.051,0,,,,,0,,,0.720,,,275.2958330,-14.5230560,16.5950530,-0.0540410,,,1665,,,G16.5951-0.0540,,
1,IRAS18182-1433,,275.2958330,-14.5230560,16.5950530,-0.0540410,,,62.5,,,0.400,Jy,,EF2007,,18 21 11,-14 31 23,1667,,,G16.585-0.051,0,,,,,0,,,0.400,,,275.2958330,-14.5230560,16.5950530,-0.0540410,,,1667,,,G16.5951-0.0540,,
1,IRAS18236-1205,,276.6320830,-12.0572220,19.3827400,-0.0480310,,,62.5,,,0.280,Jy,,EF2007,,18 26 31.7,-12 03 26,1667,,,G19.383-0.048,0,,,,,0,,,0.280,,,276.6320830,-12.0572220,19.3827400,-0.0480310,,,1667,,,G19.3827-0.0480,,
1,IRAS18236-1205,,276.6508330,-12.0816670,19.3696580,-0.0756460,20.0,32.0,31.1,12.0,,0.800,Jy,,EF2007,,18 26 36.2,-12 04 54,1665,,,G19.370-0.076,0,,,,,0,,,0.800,,,276.6508330,-12.0816670,19.3696580,-0.0756460,,,1665,,,G19.3697-0.0756,,
1,IRAS18278-1009,,277.6579170,-10.1236110,21.5626700,-0.0412230,118.0,,119.7,118.0,,0.420,Jy,,EF2007,,18 30 37.9,-10 07 25,1665,,,G21.563-0.031,0,,,,,0,,,0.420,,,277.6579170,-10.1236110,21.5626700,-0.0412230,,,1665,,,G21.5627-0.0412,,
1,IRAS18290-0924,,277.9433330,-9.3705560,22.3604220,0.0578340,76.0,84.0,78.3,8.0,,2.300,Jy,,EF2007,,18 31 46.4,-09 22 14,1665,,,G22.356+0.066,0,,,,,0,,,2.300,,,277.9433330,-9.3705560,22.3604220,0.0578340,,,1665,,,G22.3604+0.0578,,
1,IRAS18290-0924,,277.9433330,-9.3705560,22.3604220,0.0578340,,,78.5,,,0.340,Jy,,EF2007,,18 31 46.4,-09 22 14,1667,,,G22.356+0.066,0,,,,,0,,,0.340,,,277.9433330,-9.3705560,22.3604220,0.0578340,,,1667,,,G22.3604+0.0578,,
1,IRAS18310-0825,,278.4000000,-8.3294440,23.4922520,0.1383280,88.0,89.0,88.7,1.0,,1.400,Jy,,EF2007,,18 33 36,-08 19 46,1667,,,G23.492+0.138,0,,,,,0,,,1.400,,,278.4000000,-8.3294440,23.4922520,0.1383280,,,1667,,,G23.4923+0.1383,,
1,IRAS18316-0602,,278.6079170,-6.0002780,25.6545230,1.0286830,36.0,46.0,39.9,10.0,,6.000,Jy,,EF2007,,18 34 25.9,-06 00 01,1665,,,G25.655+1.029,0,,,,,0,,,6.000,,,278.6079170,-6.0002780,25.6545230,1.0286830,,,1665,,,G25.6545+1.0287,,
1,IRAS18316-0602,,278.6079170,-6.0002780,25.6545230,1.0286830,,,40.4,,,3.380,Jy,,EF2007,,18 34 25.9,-06 00 01,1667,,,G25.655+1.029,0,,,,,0,,,3.380,,,278.6079170,-6.0002780,25.6545230,1.0286830,,,1667,,,G25.6545+1.0287,,
1,IRAS18360-0537,,279.6758330,-5.6069440,26.4921430,0.2658050,102.0,,102.9,102.0,,0.540,Jy,,EF2007,,18 38 42.2,-05 36 25,1665,,,G26.492+0.266,0,,,,,0,,,0.540,,,279.6758330,-5.6069440,26.4921430,0.2658050,,,1665,,,G26.4921+0.2658,,
1,IRAS18360-0537,,279.6966670,-5.5944440,26.5127600,0.2531130,,,105.3,,,0.740,Jy,,EF2007,,18 38 47.2,-05 35 40,1667,,,G26.509+0.250,0,,,,,0,,,0.740,,,279.6966670,-5.5944440,26.5127600,0.2531130,,,1667,,,G26.5128+0.2531,,
1,IRAS18385-0512,,280.3258330,-5.1491670,27.1955350,-0.0996930,21.0,30.0,24.9,9.0,,1.010,Jy,,EF2007,,18 41 18.2,-05 08 57,1665,,,G27.209-0.099,0,,,,,0,,,1.010,,,280.3258330,-5.1491670,27.1955350,-0.0996930,,,1665,,,G27.1955-0.0997,,
1,IRAS18440-0148,,281.6575000,-1.7408330,30.8345520,0.2755080,99.0,,101.4,99.0,,6.000,Jy,,EF2007,,18 46 37.8,-01 44 27,1665,,,G30.819+0.273,0,,,,,0,,,6.000,,,281.6575000,-1.7408330,30.8345520,0.2755080,,,1665,,,G30.8346+0.2755,,
1,IRAS18440-0148,,281.6575000,-1.7408330,30.8345520,0.2755080,,,102.6,,,2.000,Jy,,EF2007,,18 46 37.8,-01 44 27,1667,,,G30.819+0.273,0,,,,,0,,,2.000,,,281.6575000,-1.7408330,30.8345520,0.2755080,,,1667,,,G30.8346+0.2755,,
1,IRAS18454-0158,,282.0054170,-1.9094440,30.8431750,-0.1108580,30.0,44.0,39.6,14.0,,0.350,Jy,,EF2007,,18 48 1.3,-01 54 34,1665,,,G30.843-0.112,0,,,,,0,,,0.350,,,282.0054170,-1.9094440,30.8431750,-0.1108580,,,1665,,,G30.8432-0.1109,,
1,IRAS18488+0000,,282.8770830,0.0558330,32.9896360,0.0097930,79.0,87.0,79.6,8.0,,4.520,Jy,,EF2007,,18 51 30.5,+00 03 21,1665,,,G32.990+0.010,0,,,,,0,,,4.520,,,282.8770830,0.0558330,32.9896360,0.0097930,,,1665,,,G32.9896+0.0098,,
1,IRAS18488+0000,,282.8770830,0.0558330,32.9896360,0.0097930,,,77.9,,,2.660,Jy,,EF2007,,18 51 30.5,+00 03 21,1667,,,G32.990+0.010,0,,,,,0,,,2.660,,,282.8770830,0.0558330,32.9896360,0.0097930,,,1667,,,G32.9896+0.0098,,
1,IRAS18507+0121,,283.3258330,1.4083330,34.3979460,0.2271950,53.0,56.0,55.8,3.0,,2.000,Jy,,EF2007,,18 53 18.2,+01 24 30,1665,,,G34.403+0.232,0,,,,,0,,,2.000,,,283.3258330,1.4083330,34.3979460,0.2271950,,,1665,,,G34.3979+0.2272,,
1,IRAS18507+0121,,283.3258330,1.4083330,34.3979460,0.2271950,,,53.9,,,1.100,Jy,,EF2007,,18 53 18.2,+01 24 30,1667,,,G34.403+0.232,0,,,,,0,,,1.100,,,283.3258330,1.4083330,34.3979460,0.2271950,,,1667,,,G34.3979+0.2272,,
1,IRAS18527+0301,,283.6937500,3.0852780,36.0580610,0.6647850,72.0,75.0,74.4,3.0,,0.210,Jy,,EF2007,,18 54 46.5,+03 05 07,1665,,,G36.058+0.665,0,,,,,0,,,0.210,,,283.6937500,3.0852780,36.0580610,0.6647850,,,1665,,,G36.0581+0.6648,,
1,IRAS18527+0301,,283.6937500,3.0852780,36.0580610,0.6647850,,,73.3,,,0.160,Jy,,EF2007,,18 54 46.5,+03 05 07,1667,,,G36.058+0.665,0,,,,,0,,,0.160,,,283.6937500,3.0852780,36.0580610,0.6647850,,,1667,,,G36.0581+0.6648,,
1,IRAS18566+0408,,284.7862500,4.1725000,37.5231310,0.1909770,52.0,92.0,83.4,40.0,,1.000,Jy,,EF2007,,18 59 8.7,+04 10 21,1665,,,G37.523+0.191,0,,,,,0,,,1.000,,,284.7862500,4.1725000,37.5231310,0.1909770,,,1665,,,G37.5231+0.1910,,
1,IRAS18566+0408,,284.7933330,4.2225000,37.5708340,0.2075420,,,81.5,,,0.500,Jy,,EF2007,,18 59 10.4,+04 13 21,1667,,,G37.554+0.201,0,,,,,0,,,0.500,,,284.7933330,4.2225000,37.5708340,0.2075420,,,1667,,,G37.5708+0.2075,,
1,IRAS19035+0641,,286.5066670,6.7763890,40.6221900,-0.1383750,,,27.3,,,22.300,Jy,,EF2007,,19 06 1.6,+06 46 35,1667,,,G40.623-0.138,0,,,,,0,,,22.300,,,286.5066670,6.7763890,40.6221900,-0.1383750,,,1667,,,G40.6225-0.1383,,
1,IRAS19092+0841,,287.9412500,8.7802780,43.0557020,-0.4758470,54.0,62.0,57.9,8.0,,3.450,Jy,,EF2007,,19 11 45.9,+08 46 49,1665,,,G43.053-0.479,0,,,,,0,,,3.450,,,287.9412500,8.7802780,43.0557020,-0.4758470,,,1665,,,G43.0557-0.4758,,
1,IRAS19092+0841,,287.9441670,8.7719440,43.0496480,-0.4822580,,,60.5,,,1.750,Jy,,EF2007,,19 11 46.6,+08 46 19,1667,,,G43.053-0.479,0,,,,,0,,,1.750,,,287.9441670,8.7719440,43.0496480,-0.4822580,,,1667,,,G43.0496-0.4823,,
1,IRAS19118+0945,,288.6237500,9.8630560,44.3273700,-0.5705800,61.0,71.0,61.3,10.0,,0.350,Jy,,EF2007,,19 14 29.7,+09 51 47,1665,,,G44.327-0.571,0,,,,,0,,,0.350,,,288.6237500,9.8630560,44.3273700,-0.5705800,,,1665,,,G44.3274-0.5706,,
1,IRAS19118+0945,,288.6237500,9.8630560,44.3273700,-0.5705800,,,58.9,,,0.220,Jy,,EF2007,,19 14 29.7,+09 51 47,1667,,,G44.327-0.571,0,,,,,0,,,0.220,,,288.6237500,9.8630560,44.3273700,-0.5705800,,,1667,,,G44.3274-0.5706,,
1,IRAS19217+1651,,290.9912500,16.9450000,51.6622240,0.7147620,-2.0,10.0,-0.2,12.0,,1.350,Jy,,EF2007,,19 23 57.9,+16 56 42,1665,,,G51.677+0.719,0,,,,,0,,,1.350,,,290.9912500,16.9450000,51.6622240,0.7147620,,,1665,,,G51.6622+0.7148,,
1,IRAS19217+1651,,290.9912500,16.9450000,51.6622240,0.7147620,,,6.7,,,1.220,Jy,,EF2007,,19 23 57.9,+16 56 42,1667,,,G51.677+0.719,0,,,,,0,,,1.220,,,290.9912500,16.9450000,51.6622240,0.7147620,,,1667,,,G51.6622+0.7148,,
1,IRAS19374+2352,,294.9058330,23.9980560,59.6087660,0.9032380,35.0,40.0,37.1,5.0,,0.460,Jy,,EF2007,,19 39 37.4,+23 59 53,1665,,,G59.601+0.917,0,,,,,0,,,0.460,,,294.9058330,23.9980560,59.6087660,0.9032380,,,1665,,,G59.6088+0.9032,,
1,IRAS19374+2352,,294.9058330,23.9980560,59.6087660,0.9032380,,,37.0,,,0.130,Jy,,EF2007,,19 39 37.4,+23 59 53,1667,,,G59.601+0.917,0,,,,,0,,,0.130,,,294.9058330,23.9980560,59.6087660,0.9032380,,,1667,,,G59.6088+0.9032,,
1,IRAS19374+2352,,294.9058330,23.9980560,59.6087660,0.9032380,,,37.1,,,0.170,Jy,,EF2007,,19 39 37.4,+23 59 53,1720,,,G59.601+0.917,0,,,,,0,,,0.170,,,294.9058330,23.9980560,59.6087660,0.9032380,,,1720,,,G59.6088+0.9032,,
1,IRAS19388+2357,,295.2925000,24.0622220,59.8388280,0.6277080,34.0,39.0,35.8,5.0,,0.320,Jy,,EF2007,,19 41 10.2,+24 03 44,1665,,,G59.839+0.628,0,,,,,0,,,0.320,,,295.2925000,24.0622220,59.8388280,0.6277080,,,1665,,,G59.8388+0.6277,,
1,IRAS19410+2336,,295.8008330,23.7341670,59.7845400,0.0614330,20.0,23.0,20.7,3.0,,0.710,Jy,,EF2007,,19 43 12.2,+23 44 03,1665,,,G59.783+0.064,0,,,,,0,,,0.710,,,295.8008330,23.7341670,59.7845400,0.0614330,,,1665,,,G59.7828+0.0640,,
1,IRAS20062+3550,,302.0529170,35.9888890,73.0669920,1.7881760,-1.0,2.2,-0.8,3.2,,0.170,Jy,,EF2007,,20 08 12.7,+35 59 20,1665,,,G73.062+1.796,0,,,,,0,,,0.170,,,302.0529170,35.9888890,73.0669920,1.7881760,,,1665,,,G73.0670+1.7882,,
1,IRAS20126+4104,,303.6085830,41.2257310,78.1223050,3.6327690,-16.0,2.0,-12.7,18.0,,2.370,Jy,,EF2007,,20 14 26.1,+41 13 32.6,1665,,,G78.122+3.633,0,,,,,0,,,2.370,,,303.6085830,41.2257310,78.1223050,3.6327690,,,1665,,,G78.1221+3.6328,,
1,IRAS20227+4154,,306.1441670,42.1033330,79.9169400,2.5620240,10.0,25.0,24.3,15.0,,0.800,Jy,,EF2007,,20 24 34.6,+42 06 12,1665,,,G79.917+2.562,0,,,,,0,,,0.800,,,306.1441670,42.1033330,79.9169400,2.5620240,,,1665,,,G79.9169+2.5620,,
1,IRAS22198+6336,,335.2529170,63.8658330,107.2608030,5.6702230,-23.0,-10.0,-12.1,13.0,,2.000,Jy,,EF2007,,22 21 0.7,+63 51 57,1665,,,G107.261+5.670,0,,,,,0,,,2.000,,,335.2529170,63.8658330,107.2608030,5.6702230,,,1665,,,G107.2608+5.6702,,
1,IRAS22198+6336,,335.4066670,63.8630560,107.3163520,5.6309960,,,-13.0,,,3.500,Jy,,EF2007,,22 21 37.6,+63 51 47,1667,,,G107.316+5.631,0,,,,,0,,,3.500,,,335.4066670,63.8630560,107.3163520,5.6309960,,,1667,,,G107.3164+5.6310,,
1,IRAS22272+6358,,337.2437500,64.2644440,108.2144240,5.5430440,-12.0,-8.0,-12.1,4.0,,1.100,Jy,,EF2007,,22 28 58.5,+64 15 52,1665,,,G108.214+5.543,0,,,,,0,,,1.100,,,337.2437500,64.2644440,108.2144240,5.5430440,,,1665,,,G108.2144+5.5430,,
1,IRAS22272+6358,,337.2437500,64.2644440,108.2144240,5.5430440,,,-12.0,,,1.680,Jy,,EF2007,,22 28 58.5,+64 15 52,1667,,,G108.214+5.543,0,,,,,0,,,1.680,,,337.2437500,64.2644440,108.2144240,5.5430440,,,1667,,,G108.2144+5.5430,,
<h1>Software error:</h1>
<pre>can't write : No such file or directory at /var/www/html/download.pl line 400.
</pre>
<p>
For help, please send mail to the webmaster (<a href="mailto:helioz@mail.ru">helioz@mail.ru</a>), giving this error message 
and the time and date of the error.

</p>
